Cannot Find Symbol Java Compiler Error

RECOMMENDED: If you have Windows errors then we strongly recommend that you download and run this (Windows) Repair Tool.

Because compiler knows now, that quiz variable cannot be null. you should learn how to find the time to learn a new skill when you are working full-time. If you think you are up to the challenge of upgrading yourself from Java developer.

Hi, I am facing a wired error. The Java application was created using JDK1.4.2 on portal 7.0. Portal 7.0 is used as web application server, no portal authorization.

The "Cannot Find Symbol" error in a Java program might mean that there isn't enough information to execute the code. Here are some possible causes.

Dec 29, 2014. >C:PyloMCreator154forgebuildsourcesjavamodmcreator mcreator_demonsHead.java:110: error: cannot find symbol. failed; see the compiler error output fo>* Try: r details. compileJava'. >Run with –stacktrace option to get the stack trace. Run with –info or –debug option to get more log output.

Feb 27, 2016. BasicHeader; [javac] ^ [javac] C:CocosProjectscocos2d-x-v.3.10Kelimece cocos2dcocosplatformandroidjavasrcorgcocos2dxlibCocos2dxDownloader. java:47: error: cannot find symbol [javac] public void onFailure(int i, Header[] headers, byte[] errorResponse, Throwable throwable) { [javac] ^ [javac].

Jun 23, 2016  · Hi,I tried to start my Solution Manager system but it got stuck as the server0 from the AS Java couldn’t start.Specs :Solution Manager 7.1.

Compilation Errors. files: ASimpleSquare.java, HelloWorld.java. When compiling your program using Jurtle, the compiler may find one or more mistakes in your program.

May 13, 2016 · Please explain the following about the "Cannot find symbol" error:. that it cannot find the symbol;. tagged java compiler-errors cannot-find-symbol or ask.

Hey all, Thanks in advance for your help. I'm a Java newbie and am having trouble compiling this program. Here's what I have so far: 2 Classes: 1.

Hey I'm just starting my first programming book on java so this should be an easy fix. Messing around with my fresh knowledge of conditionals and I'm getting the.

Can you help me work out why I am getting so many Java errors in my compiler? – Alright so i’m coding a Runescape Private Server and im getting loads (82) errors on my compiler. I’ve already asked. So now heres my error in those few lines: Server.java:207: error: cannot find symbol for(Player p :.

Itunes Unknown Error 50 Windows Xp If you can't connect to the iTunes Store, iBooks Store, or App Store. – 6 days ago. When you try to open the iTunes Store, iBooks Store, or App Store, you might see a "Cannot connect to iTunes Store" alert message or something similar. The iTunes Store. Check to see if you've turned on third-party

This is a compiler error. Let's decipher it together. The first portion of the error looks like this: /Users/staff/Desktop/java/PingPong/src/test/java/PingPongTest. java:10: error: cannot find symbol PingPong testPingPong = new PingPong(); ^. It says cannot find symbol and clearly points to the PingPong class declaration. It cannot.

But we don’t have to dig to assembly-level depths to find software patterns that low-code cannot abstract. Admittedly, OutSystems runs on top of AWS, and they.

Sample Interview Questions Interview Questions. This page lists some common interview questions for software engineers. Questions. Click on the question to.

Find. error messages for the UI apply to the API also. Provide detailed messages that will help your users fix their code. For example, in Room, if a query is run on the main thread, the user will get a java.lang.IllegalStateException: Cannot.

Explorer.exe Error Qedit.dll Cisco Cvp Error.semantic Příruční knihovna: Slovníky a glosáře. ABKLEX – slovník zkratek. ABKLEX je slovník zkratek z oboru informatiky a telekomunikací. Obsahuje výběr asi 12 800 zkratek v anglickém, německém a francouzském jazyce. Zkratky jsou rozepsány v originální podobě. Nerozlišuje se přesně psaní velkých a malých písmen. Případná. Hp Officejet Pro L7650 Printhead Error It

[javac] /Users/doekewartena/Documents/workspace/PPath/tmp/PPath/src/doeke/ path/CVector.java:146: cannot find symbol; [javac] symbol : method. occurred while executing this line: /Users/doekewartena/Documents/workspace/PPath/ resources/build.xml:141: Compile failed; see the compiler error.

Best Answer: The "Cannot find symbol" usually means it can't find the variable or name that you're trying to use. The "A08.java:20: cannot find symbol.

Internet Explorer Script Error Invalid Pointer Sep 21, 2017  · Manage all your internet downloads with this easy-to-use manager. It features a simple interface with many customizable options: Examples. The following code example demonstrates how to navigate a WebView to a URI contained in a TextBox named Address. try { Uri targetUri = new Uri(Address.Text. Caught Red Handed – It’s easy to

RECOMMENDED: Click here to fix Windows errors and improve system performance