Error C2660 Function Does Not Take Arguments

c++ Recognizing Exceptions

RECOMMENDED: If you have Windows errors then we strongly recommend that you download and run this (Windows) Repair Tool.

Yes, that is correct for the header file, but how would you use it without name in the body of the method? Or is it possible to specify a default-value parameter for.

1>h:projectsdicomtestconverttorawdcmtkofstdoffile.h(524): error C2660: ' OFFile::fflush' : function does not take 1 arguments 1>h:projectsdicomtest converttorawdcmtkofstdoffile.h(544): error C3861: '_fstat64': identifier not found 1>h:projectsdicomtestconverttorawdcmtkofstdoffile.h(556): error.

Download Visual Studio 2005 Retired documentation from. – Sep 21, 2017  · PDF files that contain the Visual Studio 2005 documentation.

Kernel awareness of the unavailable page (free/protected/guarded) causes the.

If Number Error Excel Learn What Each of the Excel Formula Error Messages Mean, and How to Use This Information to Resolve the Most Common Excel Error Types The Excel IFERROR function returns a custom result when a formula generates an error, and a standard result when no error is detected. IFERROR is an elegant way to trap and

Jan 2, 2014. Now the part to add in the Step() function I added right before "world.Step( timeStep, velocityIterations. c:documents and settingsalinxmy documents visual studio 2010projectstestb2source2.cc(276): error C2660: 'b2Fixture:: RayCast' : function does not take 2 arguments. I use the last version before the.

Because he didn’t do nearly as much to win games for his team as Altuve did. It is NOT. would take weeks to recover from. We already have a stat that.

Aug 08, 2011  · Hi all, I’m having a few problems understanding the syntax of using the CreateProcess() function. I searched the forums, and came up with this page:

Dec 17, 2012. The main idea is to have new overloads to QObject::connect which take the pointers to functions as arguments instead of char*. There are. typedef QtPrivate::FunctionPointer<Func1> SignalType ; typedef QtPrivate:: FunctionPointer<Func2> SlotType ; //compilation error if the arguments does not match.

However, even if I simply put everything inside a class, I get this error: Error 30 error C2660: 'ros::NodeHandle::subscribe' : function does not take 3 arguments C :optroswsfuertesdk-tutorialslistenerlistener.cpp 59 1 listener This simple example replicates the problem: #include "stdafx.h" #include #include.

This includes not handling it. Many languages have created more modern ways of error handling. these errors DO NOT (in most cases if your functions are.

Apr 03, 2008  · 1 2 3 4 5 6 7 8 9 10 11 12 13 14 15 16 17 18 19 20 21 22 23 24 25 26 27 28 29 30 31 32 33 34 35 36 37 38 39 40 41 42 43.

error C2660: 'isLeapYear. I encounter the "function does not take 0 arguments" error. The error you are getting is because you are not passing arguments to a.

The Court rejected Roadshow’s argument. While we do not wish to advertise these methods, it is clear that there are many available that are both simple and require no additional software or programs. While content owners may take the.

Wired – Take Wells, for instance. impairment that would affect his brain function, decision making, and impulse control," Pietrini says. "And this, we hoped, would spare.

Error Message; Compiler Error C2600 ‘function’: cannot define a compiler-generated special member function (must be declared in the class first) Compiler Error C2601

"His duty is to take care that the laws are faithfully executed. Several experts.

I'm racking my brain to figure this out. I know its something simple but I need a new set of eyes to figure out what I'm missing? Line contains ** below, 7th line.

RECOMMENDED: Click here to fix Windows errors and improve system performance