Error Does Not Name A Type

RECOMMENDED: If you have Windows errors then we strongly recommend that you download and run this (Windows) Repair Tool.

This article describes a C++ technique called type erasure and. However, because they are not part of an inheritance hierarchy, we ended up having to define a separate adapter for each class. It is repetitive, error-prone and does not.

Mar 17, 2011. What the compiler actually said: MyClass does not name a type. What the compiler was too polite to say: You idiot, you forgot to specify the.

Hi, I am working on this program and i keep running across the same error: player.cpp: error: `SimplePlayer' does not name a type player.cpp: In function `Player* get.

"Does not Name a Type" error:. whats with the DIC server telling me I don't have permission to reply to this post all the time?

I had a working project. After rearranging some code, I tried to recompile my project and then weird things started happening. Have a look at this excerpt from the.

Serverless Error —– An error occurred: S3BucketPermissions – Action does not apply. 1.2.0 <2.0.0" provider:.

Meh – but I can just type in the on-premises mailbox SMTP address. Who needs to select it from the GAL.. If you try that, then you will probably hit the SMTP delivery error mentioned. but that does not assist with this issue.

in C++ when i get an error that says xxxxx does not name a type in yyy.h What does that mean? yyy.h has included the header that xxxx is in. Example, I use: typedef.

Error: does not name a type – C / C++ – Apr 08, 2007  · Error: does not name a type. C / C++ Forums on Bytes.

Asp.net Compiler Error Message Bc30451 Name Is Not Declared To overcome this static limitation we used to take help of Server Side technologies like PHP, ASP.NET etc. same name. It will throw compile error. Right now. Compiler Error Message: BC30451: Name 'this' is not declared. BC30451: Name 'this' is not declared. \Microsoft.NET\Framework\v YOUR_VERSION \Temporary ASP.NET. He also manages a network for a Los Angeles

Aug 07, 2006  · You cannot have that. Think about how much memory would that require – infinite. B includes A, which includes B, which includes A. But you can have pointers:

error for one of these classes. I'm positive I spelled it right, so that's not the problem. I also tried forward declaration (which gave me more.

Your Domain Name System (DNS) is offline. makes the likelihood of a global.

Windows Xp Error 4e 2753 Error During Install or Uninstall | Her Interactive – Apr 5, 2014. Instructions for resolving Windows Error 2753 during installation or. 2) If you are using Windows XP, select 'Run,' and type in %TEMP% then. Introduction. This article is about recovering TeraStation systems that are failing to load correctly to get them back to

Jun 2, 2015. As you have already noticed, you cannot call methods of a class, nor access its properties, outside a "block" (as you call it). More specifically.

Hello all, I have this code: class B{ public: A hello; B(){} ~B(){} }; class A{ public: A (){} ~A(){} };. I get the error "A does not name a type" when.

I want to inherit my own class from LiquidCrystal that creates some custom characters during initialization. Here’s the code I’ve written so far: MyProject.ino #.

Error When Closing Word 2003 Fixes or workarounds for recent issues in Word for Windows. Common controls in Office ProPlus display a license error or cause an unexpected application. Visual Basic Runtime Error when closing Microsoft Word. Visual Basic Runtime Error when closing Microsoft Word. Close Microsoft Word and the error. Windows Xp Error 4e 2753 Error During Install or

compiler error is as follows: In file included from Day.cpp:1:0: Day.h:8:9: error: ‘String’ does not name a type String dayOfTheWeekString(); ^ Day.h:12:9: error: ‘String’ does not name a type String doftw; ^ Day.cpp:8:1: error: ‘String’ does not name a type String Day::dayOfTheWeekString(){ ^ make: *** [Day.o] Error 1

RECOMMENDED: Click here to fix Windows errors and improve system performance