Error Installing Component Joomla 2.5

How To Fix Joomla Extensions Installation Error

RECOMMENDED: If you have Windows errors then we strongly recommend that you download and run this (Windows) Repair Tool.

Error Installing Ruby-debug-base19 Windows I'm trying to install Rails on Windows 7. When I install I get this error: make generating ruby_debug-i386-mingw32.def compiling breakpoint.c compiling ruby_debug.c. installing Ruby-Debug-Base19 under Windows 7 – Ruby Forum – Forum: Ruby installing Ruby-Debug-Base19 under Windows 7. Forum List Topic List New Topic Search Register User List Log In. ERROR: Error installing ruby-debug. Print

AMP is a collection of three main elements: a set of recommendations for HTML code (allows to create content using HTML code along with AMP extensions),

2 and the 2.5-inch versions. is a proven component in the form of Silicon Motion’s SM2258. We’ve previously seen the controller in other drives and it.

I am trying to install DocmanExport component in a site with Joomla 2.5. I am always getting the error Unable to write entry when I upload the component and click install. I need to export the settings and need to move it to Joomla 3.5 installation.

Download the free trial version below to get started. Double-click the downloaded file to install the software.

When installing custom component on a Joomla 2.5 everything works well. If I just copy and paste the content of the component in the appropriate folder /components.

How to Fix Error 2 in 2 Minutes. Follow These 4 Steps. (Highly Recommended)

May 14, 2012. Copy failed JInstaller: :Install: Failed to copy file..yoo_subway/index.php. Hi , Im trying to update the template subway , but I got that error: Copy failed JInstaller : :Install: Failed to copy file..yoo_subway/index.php. I'm using joomla 2.5. Thanks so much. Subway. Order by Votes Newest Active.

error install component and modules. Need help installing Joomla!?. Общие вопросы/Новичок в Joomla! 2.5.

This document is a guide to LCDproc written for users. It covers LCDproc 0.5.x

UI Test Automation – BDD can be applied for any type of testing including unit tests, component, integration as well as for many. 3000 (tests) * 3 (browsers) * 2.5 (lost seconds.

Dec 11, 2017  · Microsoft. The fiercely competitive software giant is positioning its wares for cloud computing with software and services. The company’s two cash cows -.

Sep 15, 2011. "ERROR: Could not find a CB XML setup file in the package". This message is generated by CB and it. Joomla extensions installer instead. Typically, Modules , Components, Joomla Templates, Joomla Languages, Joomla system and content plugins should not be installed using the CB Plugins installer.

Error Lnk1201 Error Writing To Program Database Visual Studio: fatal error LNK1201: error writing to program database '…' check for insufficient disk space, invalid path, or insufficient privilege. I get this error: fatal error LNK1201: error writing to program database every time I edit my code and build again in visual studio 2003. The issue is resolved if I. LNK1201 Error at

In this tutorial, we'll walk you through the steps of installing a Joomla 2.5 Component.

Microsoft acknowledges that some users are getting error "Sync Center Error. we are not aware of any issue experienced when installing the update. Apple Seeds First iOS 11.2.5, watchOS 4.2.2, and tvOS 11.2.5 Betas to.

RECOMMENDED: Click here to fix Windows errors and improve system performance