Faac Error Mpeg4ip.h

RECOMMENDED: If you have Windows errors then we strongly recommend that you download and run this (Windows) Repair Tool.

2013年10月6日. http://sourceforge.net/projects/faac/files/faac-src/faac-1.28/. mpeg4ip.h:126: error: new declaration 'char* strcasestr(const char*, const char*)'

Windows Installer Package Error 1722 Windows 7 Download Our 25-Page Guide: How to Overcome Windows 10 Hurdles. After upgrading to Windows 10, many IT departments run into challenges with the new OS. Error 1722 on Windows 7. Windows 7 IT Pro > Windows 7 Miscellaneous. I am getting error 1722, there is a problem with the windows installer package. The cumulative update

faac-1.28 error Linux. a guest Jun 16th, 2015 226 Never Not a member. In file included from mpeg4ip.h:107:0, from mp4common.h:29,

Uninstall Norton 360 Error 21 Php Parse Error Syntax Error Unexpected T_echo Expecting T_function Parse error: syntax error, unexpected T_IF, expecting T_FUNCTION in C:\wamp\www\Exam Creator\cls_FillInTheBlank.php on line 31 I received this error while trying to. What is causing this error? Parse error: syntax error, unexpected T_ECHO in C:\wamp\www\game\rankings.php on line 19 Here is the code <?php session_start. You didn't terminate/close

ubuntu – Installing FAAC on linux, getting errors – Stack. – Remove line 126 containing strcasestr from mpeg4ip.h found in the common/mp4v2 folder, as a temporary workaround. It seems it does not properly exclude its own.

Free Cable Xbmc Script Error This is the best xbmc add-on repo i have seen, Space invaders: script failed — Gmail Checker:. I found free cable add-on by trial and error. Some free services, such as Filmon, already exist but you view on your PC or connect a cable to your main TV, however the image quality isn’t so good,

mpeg4ip_win32.h:70:57: error: 'vsnprintf_s' was not declared in this scope. Entering directory `/home/rogerdpack/dev/downloads/faac-1.28/frontend.

faac 编译错误问题!注释掉faac-1.28/common/mp4v2/mpeg4ip.h 里的第126行 char *strcasestr(const char *haystack, const char *needle); 重新.

2013年10月6日. tar zxvf faac-1.28. tar.gz. make[2]: Leaving directory `/faac-1.28/libfaac' Making all in common make[2]:. strcasestr(const char*, const char*)' /usr/include/string.h :369: error: ambiguates old. vi common /mp4v2/mpeg4ip.h.

FAAC-1.28 kompilieren – Ubuntu Hilfe – 22. Juli 2014. Wenn man versucht FAAC zu kompilieren bekommt man folgenden. mpeg4ip.h: 126: error: new declaration ‚char* strcasestr(const char*,

13. Sept. 2016. Wenn man versucht FAAC zu kompilieren bekommt man folgenden. mpeg4ip.h: 126: error: new declaration ‚char* strcasestr(const char*,

Jul 24, 2015. 출처 : TOPIC: Setting server issues with FAAC Setting server issues with. mpeg4ip.h:126:58: error: new declaration 'char* strcasestr(const.

Logged In: YES user_id=666181 Originator: YES. Fixed. I wrote a patch which lets faac-1.26 build flawlessly under msys+mingw too (and the patch was tested under.

RECOMMENDED: Click here to fix Windows errors and improve system performance