Make Modules Error 2

RECOMMENDED: If you have Windows errors then we strongly recommend that you download and run this (Windows) Repair Tool.

Java – If you make your application modular (i.e. start breaking your application into modules with module-info.java files and start using module path instead of classpath) and have dependencies on these same jar files, you’ll get an error.

Diagnosis HOWTO – PPTP Client – On Red Hat 7.3, the kernel version is usually 2.4.18-3. Diagnosis: the 2.4.0-4 ppp-mppe package provides a ppp package without a version. The newer Red Hat kernel.

Aug 22, 2005. 2) Next go to your kernel module source code directory and simply create the Makefile. 4) Compile module using make command (module build can be done by any user) :. make[1]: *** [_module_/home/mclamna] Error 2

Makefile:65: recipe for target 'module' failed make: *** [module] Error 2. -) I tried to create the /lib/modules/4.1.15-rt17-4.0.0f0/build folder and try.

I had troubles than I removed and reinstalled JetPack on redfoxy.it than I reconnect it with my account but when I goes to activate my social networks i got "There was an error retrieving your site settings. Make sure your Jetpack is up to.

Make does not compile modules. Error: Building modules, stage 2. MODPOST 0 modules. up vote 2 down vote favorite. 1.

make[1]: *** /lib/modules/3.4.39/build: No such file or directory. Stop. Makefile: 584: recipe for target 'modules' failed; make: *** [modules] Error 2.

Error Of Judgement Quotes Error Message Unable To Write Print Data Broken Pipe You can feel however you want about LeBron James—he’s maybe the greatest professional basketball player of all time, so some of your feelings are going to fall under the category of “wrong”—but you can only feel one way about this. SwingNote provides enterprise solutions in software

Hello, This thread may be a little long, but it is this way, 'cause of I think this may help you to clarify the trouble. Anyway Thank You for

1, for example, one of the human-driven cars on the outside makes an error and cuts in on. the autonomous vehicle will never make a command outside of the.

Thank you for supporting the partners who make SitePoint possible. In this 2-part series, Google Developer Experts Jurgen. WebStorm automatically adds the.

Jun 09, 2009  · That file (arch/Kconfig) should definitely be there. It would seem that openfiler has tampered with it somehow, to try to make re-configuration impossible.

Its got a fast processor combined with 4GB of RAM to make everything. by a.

Black & Gold Shared System The Shared System re-made in Black and Gold w/ the Erbe-Verb, Morphagene and CV Bus added. The personal favorite system of Make Noise.

Aug 16, 2017. make[1]: *** [all] Error 2 make[1]: Leaving directory '/usr/src/linux-headers-4.11.0- kali1-amd64' Makefile:1264: recipe for target 'modules' failed

Error Extracting Information About The Document Acca Dec 6, 2016. Error reports should be produced which list rejected items– for example, computer files, re-perform calculations or extract items for further investigation. leavers, which could then be checked to appropriate documentation. Error Message Unable To Write Print Data Broken Pipe You can feel however you want about LeBron James—he’s maybe the greatest professional

common lisp racket clojure emacs lisp; version used SBCL 1.2: Racket 6.1: Clojure 1.6: Emacs 24.5: show version $ sbcl –version $ racket –version: displayed by repl.

Here is the entire output I get when I do 'make modules'. Can anyone help? make -r -f tmp_include_depends all make[1]: Entering directory `/usr/src/linux-2.4.20-18.9'

I followed all instructions but every time I get the following error:. Authentication requested for make clean:. make: *** [modules] Error 2

I was trying to install Realtek_RTS5229_Linux_Driver_v1.07 which I downloaded from [here][1] When I run the make command I get the following error:- make[1]: Leaving.

Error Buffer Overrun Detected Every time I double click CoDSP.exe this error message comes up: "Microsoft Visual C++ Runtime Library Buffer overrun. C++ Runtime Library Buffer overrun detected! Buffer overflow attacks have been there for a long time. It still exists today partly because of programmers carelessness while writing a code. The reason Buffer Overrun Microsoft Visual C++ –

RECOMMENDED: Click here to fix Windows errors and improve system performance